{"text_format":"1","workbook":"xlsx","n_sheets":5,"sheets":["1.PERFIL DE RIESGO_PN","4.PN","1.PERFIL DE RIESGO_PJ","3.PJ","2.variables"],"not_rendered":{"charts":0,"images":11,"macros":1,"external_links":0,"defined_names":7,"comments":0,"pivot_tables":0},"unopened":[],"bounds":{"document_bytes":16777216,"sheet_cells":100000,"rows_first":2000,"rows_last":500,"rows_between":2000,"halvings":0,"cell_chars":16384,"cell_head_chars":4096},"cells_cut":0,"cells_raw":0,"read":"whole","date_system":"1900"}

{"sheet":"1.PERFIL DE RIESGO_PN","index":0,"n_rows":50,"n_cols":22,"rows_kept":50,"cut":false,"hidden":false,"merged":[[0,8,1,8],[0,2,0,7],[1,2,1,7],[2,2,2,7],[40,0,41,3],[40,5,41,8],[26,3,26,8],[28,3,28,8],[29,0,29,1],[28,0,28,2],[29,3,29,4],[29,5,29,8],[26,0,26,2],[27,0,27,2],[25,3,25,8],[21,0,21,8],[43,0,44,3],[43,4,44,8],[37,6,37,8],[37,0,37,2],[31,0,31,8],[34,1,34,6],[23,0,24,2],[23,3,23,4],[23,5,23,8],[24,3,24,4],[24,5,24,8],[27,3,27,8],[16,6,16,8],[8,4,8,8],[25,0,25,2],[17,5,17,8],[18,5,18,8],[19,5,19,8],[9,0,9,3],[10,0,10,3],[11,0,11,3],[13,0,13,3],[12,0,12,1],[12,2,12,3],[9,4,9,8],[10,4,15,8],[17,0,17,4],[6,0,6,2],[4,0,4,8],[6,3,6,5],[7,4,7,5],[6,6,7,7],[19,0,19,4],[14,0,14,3],[15,0,15,3],[16,0,16,1],[16,2,16,4],[18,0,18,4]]}
[null,null,"GESTIÓN DE CUMPLIMIENTO ",null,null,null,null,null,"GCU-LAFT-FOT01"]
[null,null,"SARLAFT"]
[null,null,"CALCULO DEL PERFIL DE RIESGO DEL POTENCIAL CLIENTE PN",null,null,null,null,null,"00"]
[null,null,"Aprobado por: ","Director de Cumplimiento","Clasificación de la información diligenciada:","Interno","Uso de la información:","Operacional","2023-08-10"]
["Diligencie todos los espacios del formato. (No dejar campos en blanco)."]
[]
["Fecha de diligenciamiento",null,null,"Nombre y cargo de quien realiza el conocimiento del cliente/entrevista",null,null,"Cod. Oficina \n(Para sala de ventas aplica solo la oficina 946)"]
["Dia","Mes","Año","Nombre del dueño de la relación comercial o sala de ventas",null,null,null,null,{"$f":"IFERROR(VLOOKUP(($I$7)*1,'2.variables'!$Q$1:$R$421,2,FALSE),\"\")","v":""}]
[null,null,null,"Cargo:"]
["Tipo de entrevista:",null,null,null,"Concepto de la entrevista"]
["Entrevista presencial "]
["Entrevista no presencial"]
[" ¿Cuál?"]
["Entrevista realizada por:"]
["Funcionario Fidupopular"]
["Funcionario Sala de Ventas"]
["Nombre cliente:",null,null,null,null,"ID Cliente:"]
["Tipo de personería",null,null,null,null,"Tipo De producto a Aperturar"]
[]
[]
[]
["FACTOR CLIENTE PN"]
[]
["1. ACTIVIDAD ECONOMICA:\n(Validar por código CIIU)",null,null,"CIIU:",null,""]
[null,null,null,"Descripción:",null,{"$f":"IFERROR(VLOOKUP(($F$24)*1,'4.PN'!A3:D510,2,FALSE),\"\")","v":""}]
["2. PATRIMONIO:"]
["3. NACIONALIDAD:",null,null,""]
["4. INGRESOS:"]
["5. EGRESOS:"]
["6. TRABAJA EN EL SECTOR PUBLICO:",null,null,"ACTIVIDAD SECTOR PUBLICO:",null,null,null,null,null,null,null,null,null,null,null,null,null,null,null,null,null,{"$f":"+IF($C$30=\"NO\",1,0)","v":0}]
{"$rows_left_out":21}
{"sheet":"4.PN","index":1,"n_rows":1916,"n_cols":30,"rows_kept":1916,"cut":false,"hidden":true,"merged":[[1,26,1,27],[3,5,6,5],[1,0,1,2],[1,5,1,9],[1,12,1,15],[1,18,1,19],[1,22,1,23]]}
["Facto cliente ",0.7]
["ACTIVIDAD ECONOMICA",null,null,0.4,null,"PATRIMONIO",null,null,null,null,0.1,null,"NACIONALIDAD",null,null,null,0.1,null,"INGRESOS",null,0.2,null,"EGRESOS",null,0.05,null,"SECTOR PUBLICO ",null,0.15,"S/N"]
["Código","Descripción","Rango o puntaje","Nivel de riesgo",null,"Tipo de Persona","Percentil","Cuartil","Nivel de Patrimonio","Rango o puntaje","Nivel de riesgo",null,"Código","Código2","Descripcion País","Rango o puntaje","Nivel de Riesgo",null,"RANGO","SCORE","Nivel de Riesgo",null,"RANGO","SCORE","Nivel de Riesgo",null,"CRM-PS","Nombre","Rango o puntaje","Nivel de riesgo"]
[10,"ASALARIADOS",2.5,"BAJO",null,"Natural",1,4,"Mayor a 110 SMLV",2.5,"BAJO",null,"AFG","AF","Afganistán",7.5,"ALTO",null,"Entre 0 y 3 SMLMV",2.5,"BAJO",null,"Menor o igual al 35% de los ingresos",2.5,"BAJO",null,8,"Privada",2.5,"BAJO"]
[20,"PENSIONADOS",2.5,"BAJO",null,null,0.75,3,"Entre 34 SMLV y 110 SMLV",5,"MODERADO",null,"ALB","AL","Albania",7.5,"ALTO",null,"Entre 3 y  6 SMLMV",5,"MODERADO",null,"Mayor al 35 % - menor igual al 70% de los ingresos",5,"MODERADO",null,5,"Privada nacional",2.5,"BAJO"]
[81,"PERSONAS NATURALES SIN ACTIVIDAD ECONÓMICA",2.5,"BAJO",null,null,0.5,2,"Entre 3 SMLV y 33 SMLV ",7.5,"ALTO",null,"DZA","DZ","Argelia",7.5,"ALTO",null,"Entre 6 y 10 SMLMV",7.5,"ALTO",null,"Mayor al 70% - menor igual al 100% de los ingresos",7.5,"ALTO",null,4,"Privada extranjera",2.5,"BAJO"]
[82,"PERSONAS NATURALES SUBSIDIADAS POR TERCEROS",2.5,"BAJO",null,null,0.25,1,"Menor o igual a 2  SMLV",10,"EXTREMO",null,"AND","AD","Andorra",2.5,"BAJO",null,"Superior a 10 SMLMV",10,"EXTREMO",null,"Superior a 100% de los ingresos",10,"EXTREMO",null,6,"Privada multinacional",2.5,"BAJO"]
[90,"RENTISTAS DE CAPITAL SOLO PARA PERSONAS NATURALES",2.5,"BAJO",null,null,null,null,null,null,null,null,"AGO","AO","Angola",7.5,"ALTO",null,null,null,null,null,null,null,null,null,1,"Pública nacional",10,"EXTREMO"]
[111,"CULTIVO DE CEREALES (EXCEPTO ARROZ), LEGUMBRES Y SEMILLAS OLEAGINOSAS",5,"MODERADO",null,null,null,null,null,null,null,null,"AtG","AG","Antigua y Barbuda",7.5,"ALTO",null,null,null,null,null,null,null,null,null,2,"Pública departamental",10,"EXTREMO"]
[112,"CULTIVO DE ARROZ",5,"MODERADO",null,null,null,null,null,null,null,null,"ARG","AR","Argentina",7.5,"ALTO",null,null,null,null,null,null,null,null,null,3,"Pública municipal",10,"EXTREMO"]
[113,"CULTIVO DE HORTALIZAS, RAÍCES Y TUBÉRCULOS",5,"MODERADO",null,null,null,null,null,null,null,null,"ARM","AM","Armenia",5,"MODERADO",null,null,null,null,null,null,null,null,null,9,"Pública extranjera",10,"EXTREMO"]
[114,"CULTIVO DE TABACO",2.5,"BAJO",null,null,null,null,null,null,null,null,"AUS","AU","Australia",5,"MODERADO",null,null,null,null,null,null,null,null,null,7,"Sin ánimo de lucro",2.5,"BAJO"]
[115,"CULTIVO DE PLANTAS TEXTILES",5,"MODERADO",null,null,null,null,null,null,null,null,"AUT","AT","Austria",5,"MODERADO",null,null,null,null,null,null,null,null,null,3,"Entidades Oficiales",10,"EXTREMO"]
[119,"OTROS CULTIVOS TRANSITORIOS N.C.P.",5,"MODERADO",null,null,null,null,null,null,null,null,"AZE","AZ","Azerbaiyán",7.5,"ALTO",null,null,null,null,null,null,null,null,null,0,"Tipo de Organización sin validar",2.5,"BAJO"]
[121,"CULTIVO DE FRUTAS TROPICALES Y SUBTROPICALES",2.5,"BAJO",null,null,null,null,null,null,null,null,"BHS","BS","Bahamas",7.5,"ALTO"]
[122,"CULTIVO DE PLÁTANO Y BANANO",5,"MODERADO",null,null,null,null,null,null,null,null,"BHR","BH","Bahrein",5,"MODERADO"]
[123,"CULTIVO DE CAFÉ",5,"MODERADO",null,null,null,null,null,null,null,null,"BGD","BD","Bangladesh",7.5,"ALTO"]
[124,"CULTIVO DE CAÑA DE AZÚCAR",5,"MODERADO",null,null,null,null,null,null,null,null,"BRB","BB","Barbados",7.5,"ALTO"]
[125,"CULTIVO DE FLOR DE CORTE",2.5,"BAJO",null,null,null,null,null,null,null,null,"BLR","BY","Bielorrusia",2.5,"BAJO"]
[126,"CULTIVO DE PALMA PARA ACEITE (PALMA AFRICANA) Y OTROS FRUTOS OLEAGINOSOS",5,"MODERADO",null,null,null,null,null,null,null,null,"BEL","BE","Bélgica",5,"MODERADO"]
[127,"CULTIVO DE PLANTAS CON LAS QUE SE PREPARAN BEBIDAS",2.5,"BAJO",null,null,null,null,null,null,null,null,"BLZ","BZ","Belice",7.5,"ALTO"]
[128,"CULTIVO DE ESPECIAS Y DE PLANTAS AROMÁTICAS Y MEDICINALES",5,"MODERADO",null,null,null,null,null,null,null,null,"BEN","BJ","Benín",7.5,"ALTO"]
[129,"OTROS CULTIVOS PERMANENTES N.C.P.",5,"MODERADO",null,null,null,null,null,null,null,null,"BTN","BT","Bután",2.5,"BAJO"]
[130,"PROPAGACIÓN DE PLANTAS (ACTIVIDADES DE LOS VIVEROS, EXCEPTO VIVEROS FORESTALES)",2.5,"BAJO",null,null,null,null,null,null,null,null,"BOL","BO","Bolivia",7.5,"ALTO"]
[141,"CRÍA DE GANADO BOVINO Y BUFALINO",5,"MODERADO",null,null,null,null,null,null,null,null,"BIH","BA","Bosnia y Herzegovina",7.5,"ALTO"]
[142,"CRÍA DE CABALLOS Y OTROS EQUINOS",5,"MODERADO",null,null,null,null,null,null,null,null,"BWA","BW","Botsuana",7.5,"ALTO"]
[143,"CRÍA DE OVEJAS Y CABRAS",5,"MODERADO",null,null,null,null,null,null,null,null,"BRA","BR","Brasil",7.5,"ALTO"]
[144,"CRÍA DE GANADO PORCINO",5,"MODERADO",null,null,null,null,null,null,null,null,"BRN","BN","Brunei Darussalam",2.5,"BAJO"]
[145,"CRÍA DE AVES DE CORRAL",5,"MODERADO",null,null,null,null,null,null,null,null,"BGR","BG","Bulgaria",5,"MODERADO"]
[149,"CRÍA DE OTROS ANIMALES N.C.P.",5,"MODERADO",null,null,null,null,null,null,null,null,"BFA","BF","Burkina Faso",2.5,"BAJO"]
{"$rows_left_out":1887}
{"sheet":"1.PERFIL DE RIESGO_PJ","index":2,"n_rows":47,"n_cols":23,"rows_kept":47,"cut":false,"hidden":true,"merged":[[42,0,43,3],[42,4,43,8],[39,0,40,3],[39,5,40,8],[34,1,34,6],[37,0,37,2],[37,6,37,8],[31,0,31,8],[25,0,25,2],[25,3,25,8],[26,0,26,2],[26,3,26,8],[27,0,27,2],[27,3,27,8],[28,0,28,2],[28,3,28,8],[29,0,29,1],[29,3,29,4],[29,5,29,8],[23,0,24,2],[23,3,23,4],[23,5,23,8],[24,3,24,4],[24,5,24,8],[21,0,21,8],[18,0,18,4],[19,0,19,4],[9,0,9,3],[9,4,9,8],[10,0,10,3],[10,4,15,8],[12,0,12,1],[12,2,12,3],[14,0,14,3],[15,0,15,3],[13,0,13,3],[19,5,19,8],[18,5,18,8],[11,0,11,3],[17,5,17,8],[16,6,16,8],[16,0,16,1],[16,2,16,4],[17,0,17,4],[0,8,1,8],[1,2,1,7],[2,2,2,7],[4,0,4,8],[7,6,8,7],[6,0,6,2],[7,4,7,5],[6,3,6,8],[8,4,8,5],[0,2,0,7]]}
[null,null,"GESTIÓN DE CUMPLIMIENTO - GCU",null,null,null,null,null,"GCU-FOT-094"]
[null,null,"SARLAFT"]
[null,null,"CALCULO DEL PERFIL DE RIESGO DEL POTENCIAL CLIENTE PJ",null,null,null,null,null,"00"]
[null,null,"Aprobado por: ","Director de Cumplimiento","Clasificación de la información diligenciada:","Interno","Uso de la información:","Operacional","2023-08-03"]
["Diligencie todos los espacios del formato. (No dejar campos en blanco)."]
[]
["Fecha de diligenciamiento",null,null,"Nombre y cargo de quien realiza el conocimiento del cliente/entrevista"]
["Dia","Mes","Año","Nombre del dueño de la relación comercial o sala de ventas",null,null,"Cod. Oficina \n(Para sala de ventas aplica solo la oficina 946)"]
[null,null,null,"Cargo:",null,null,null,null,{"$f":"IFERROR(VLOOKUP(($I$8)*1,'2.variables'!$Q$1:$R$421,2,FALSE),\"\")","v":""}]
["Tipo de entrevista:",null,null,null,"Concepto de la entrevista"]
["Entrevista presencial "]
["Entrevista no presencial"]
[" ¿Cuál?"]
["Entrevista realizada por:"]
["Funcionario Fidupopular"]
["Funcionario Sala de Ventas"]
["Nombre cliente:",null,null,null,null,"ID Cliente:"]
["Tipo de personería",null,null,null,null,"Tipo De producto a Aperturar"]
[]
[]
[]
["FACTOR CLIENTE PJ"]
[]
["1. ACTIVIDAD ECONOMICA:\n(Validar por código CIIU)",null,null,"CIIU:",null,""]
[null,null,null,"Descripción:",null,{"$f":"IFERROR(VLOOKUP(($F$24)*1,'4.PN'!A3:D510,2,FALSE),\"\")","v":""}]
["2. PATRIMONIO:"]
["3. NACIONALIDAD:"]
["4. INGRESOS:"]
["5. EGRESOS:"]
["6. TRABAJA EN EL SECTOR PUBLICO:",null,null,"ACTIVIDAD SECTOR PUBLICO:",null,null,null,null,null,null,null,null,null,null,null,null,null,null,null,null,null,null,{"$f":"+IF($C$30=\"NO\",1,0)","v":0}]
{"$rows_left_out":18}
{"sheet":"3.PJ","index":3,"n_rows":1890,"n_cols":29,"rows_kept":1890,"cut":false,"hidden":true,"merged":[[2,21,2,22],[2,25,2,26],[4,5,8,5],[2,5,2,8],[2,0,2,2],[2,11,2,14],[2,17,2,18]]}
["Facto cliente ",0.7]
[]
["ACTIVIDAD ECONOMICA",null,null,0.4,null,"PATRIMONIO",null,null,null,0.1,null,"NACIONALIDAD",null,null,null,0.1,null,"INGRESOS",null,0.2,null,"EGRESOS",null,0.05,null,"SECTOR PUBLICO ",null,0.15,"S/N"]
["Código","Descripción","Rango o puntaje","Nivel de riesgo",null,"Tipo de Persona","Nivel de Patrimonio","Criterio","Rango o puntaje","Nivel de riesgo",null,"Código","Código","Descripcion País","Rango o puntaje","Nivel de Riesgo",null,"RANGO","SCORE","Nivel de Riesgo",null,"RANGO","SCORE","Nivel de Riesgo",null,"CRM-PS","Nombre","Rango o puntaje","Nivel de riesgo"]
[10,"ASALARIADOS",2.5,"BAJO",null,"Jurídica","Empresa Grande"," Mayor a 30.000 SMMLV",2.5,"BAJO",null,"AFG","AF","Afganistán",7.5,"ALTO",null,"Menor o igual a 10.000 SMLMV",2.5,"BAJO",null,"Menor o igual al 35% de los ingresos",2.5,"BAJO",null,8,"Privada",2.5,"BAJO"]
[20,"PENSIONADOS",2.5,"BAJO",null,null,"Empresa mediana"," Entre 5001 y 30.000 SMMLV",5,"MODERADO",null,"ALB","AL","Albania",7.5,"ALTO",null,"Entre 10.000 y 23.000 SMLMV",5,"MODERADO",null,"Mayor al 35 % - menor igual al 70% de los ingresos",5,"MODERADO",null,5,"Privada nacional",2.5,"BAJO"]
[81,"Personas naturales y sucesiones ilíquidas sin actividad económica",2.5,"BAJO",null,null,"Pequeña empresa ","Entre 501 y 5000 SMMLV",7.5,"ALTO",null,"DZA","DZ","Argelia",7.5,"ALTO",null,"Entre 23.000 y 40.000 SMLMV",7.5,"ALTO",null,"Mayor al 70% - menor igual al 100% de los ingresos",7.5,"ALTO",null,4,"Privada extranjera",2.5,"BAJO"]
[82,"Personas naturales subsidiadas por terceros",2.5,"BAJO",null,null,"Microempresa"," Menor o igual a 500 SMMLV",10,"EXTREMO",null,"AND","AD","Andorra",2.5,"BAJO",null,"Superior a 40.000 SMLMV",10,"EXTREMO",null,"Superior a 100% de los ingresos",10,"EXTREMO",null,6,"Privada multinacional",2.5,"BAJO"]
[90,"RENTISTAS DE CAPITAL ",2.5,"BAJO",null,null,"Vacio","Vacio",10,"EXTREMO",null,"AGO","AO","Angola",7.5,"ALTO",null,"VACIO ",10,"EXTREMO",null,"VACIO",10,"EXTREMO",null,1,"Pública nacional",10,"EXTREMO"]
[111,"CULT.CEREALES(EXCP ARROZ),LEGUMBR,SEMILL",5,"MODERADO",null,null,null,null,null,null,null,"AtG","AG","Antigua y Barbuda",7.5,"ALTO",null,null,null,null,null,null,null,null,null,2,"Pública departamental",10,"EXTREMO"]
[112,"CULTIVO DE ARROZ",5,"MODERADO",null,null,null,null,null,null,null,"ARG","AR","Argentina",7.5,"ALTO",null,null,null,null,null,null,null,null,null,3,"Pública municipal",10,"EXTREMO"]
[113,"CULTIVO DE HORTALIZAS,RAÍCES ,TUBÉRCULOS",5,"MODERADO",null,null,null,null,null,null,null,"ARM","AM","Armenia",5,"MODERADO",null,null,null,null,null,null,null,null,null,9,"Pública extranjera",10,"EXTREMO"]
[114,"CULTIVO DE TABACO",2.5,"BAJO",null,null,null,null,null,null,null,"AUS","AU","Australia",5,"MODERADO",null,null,null,null,null,null,null,null,null,7,"Sin ánimo de lucro",2.5,"BAJO"]
[115,"CULTIVO DE PLANTAS TEXTILES",5,"MODERADO",null,null,null,null,null,null,null,"AUT","AT","Austria",5,"MODERADO",null,null,null,null,null,null,null,null,null,3,"Entidades Oficiales",10,"EXTREMO"]
[119,"OTROS CULTIVOS TRANSITORIOS N.C.P.",5,"MODERADO",null,null,null,null,null,null,null,"AZE","AZ","Azerbaiyán",7.5,"ALTO",null,null,null,null,null,null,null,null,null,0,"Tipo de Organización sin validar",2.5,"BAJO"]
[121,"CULTIVO DE FRUTAS TROPICALES-SUBTROPICAL",2.5,"BAJO",null,null,null,null,null,null,null,"BHS","BS","Bahamas",7.5,"ALTO"]
[122,"CULTIVO DE PLÁTANO Y BANANO",5,"MODERADO",null,null,null,null,null,null,null,"BHR","BH","Bahrein",5,"MODERADO"]
[123,"CULTIVO DE CAFÉ",5,"MODERADO",null,null,null,null,null,null,null,"BGD","BD","Bangladesh",7.5,"ALTO"]
[124,"CULTIVO DE CAÑA DE AZÚCAR",5,"MODERADO",null,null,null,null,null,null,null,"BRB","BB","Barbados",7.5,"ALTO"]
[125,"CULTIVO DE FLOR DE CORTE",2.5,"BAJO",null,null,null,null,null,null,null,"BLR","BY","Bielorrusia",2.5,"BAJO"]
[126,"CULT.PALMA/ACEITE (P.AFRIC),OTRS OLEAGIN",5,"MODERADO",null,null,null,null,null,null,null,"BEL","BE","Bélgica",5,"MODERADO"]
[127,"CULT.DE PLANTAS CON LAS QUE PREPA.BEBIDA",2.5,"BAJO",null,null,null,null,null,null,null,"BLZ","BZ","Belice",7.5,"ALTO"]
[128,"CULTIVO.ESPECIAS,PLANTAS AROMAT,MEDICIN.",5,"MODERADO",null,null,null,null,null,null,null,"BEN","BJ","Benín",7.5,"ALTO"]
[129,"OTROS CULTIVOS PERMANENTES N.C.P.",5,"MODERADO",null,null,null,null,null,null,null,"BTN","BT","Bután",2.5,"BAJO"]
[130,"PROPAGACION DE PLANTAS,ACTIVIDAD.VIVEROS",2.5,"BAJO",null,null,null,null,null,null,null,"BOL","BO","Bolivia",7.5,"ALTO"]
[141,"CRÍA DE GANADO BOVINO Y BUFALINO",5,"MODERADO",null,null,null,null,null,null,null,"BIH","BA","Bosnia y Herzegovina",7.5,"ALTO"]
[142,"CRÍA DE CABALLOS Y OTROS EQUINOS",5,"MODERADO",null,null,null,null,null,null,null,"BWA","BW","Botsuana",7.5,"ALTO"]
[143,"CRIA DE OVEAJS Y CABRAS",5,"MODERADO",null,null,null,null,null,null,null,"BRA","BR","Brasil",7.5,"ALTO"]
[144,"CRÍA DE GANADO PORCINO",5,"MODERADO",null,null,null,null,null,null,null,"BRN","BN","Brunei Darussalam",2.5,"BAJO"]
[145,"CRÍA DE AVES DE CORRAL",5,"MODERADO",null,null,null,null,null,null,null,"BGR","BG","Bulgaria",5,"MODERADO"]
{"$rows_left_out":1861}
{"sheet":"2.variables","index":4,"n_rows":421,"n_cols":22,"rows_kept":421,"cut":false,"hidden":true,"merged":[[0,11,0,12],[0,13,0,14]]}
["DIA","MES","AÑO",null,"SECTOR PUBLICO:",null,"pep","CARGO PEP",null,null,null,"Rango Puntaje",null,"Nivel de Riesgo",null,null,"CÓDIGO","NOMBRE OFICINA",null,null,"TIPO DE ENTREVISTA"]
[1,1,2021,null,"SI",null,"SI","PEP DECRETO 1674/16 - 830/21",null,null,null,0,2.5,"BAJO","● Debida diligencia.\n● Consulta AMLRISK y CENTINELA.\n● Proceso de actualizacion mínimo 1 vez cada 3 años.",null,1,"BOGOTA - WEB 961",null,null,"CUAL","TELEFONICA"]
[2,2,2022,null,"NO",null,"NO","PEP INTERNACIONAL",null,null,null,2.6,5,"MODERADO","● Debida diligencia Ampliada.\n● Consulta AMLRISK y CENTINELA.\n● Proceso de actualizacion mínimo 1 vez cada 3 años.",null,2,"ZONA NOROCCIDENTAL-MEDELLIN - NO VIGENTES",null,null,null,"VIRTUAL"]
[3,3,2023,null,null,null,null,"PEP ORGANISMOS INTERNACIONALES",null,null,null,5.0999999999999996,7.5,"ALTO","● Debida diligencia Ampliada.\n● Consulta AMLRISK y CENTINELA.\n● Proceso de actualizacion mínimo 1 vez al año",null,3,"ZONA SUR - CALI - SOLO UNA VIGENTE"]
[4,4,2024,null,null,null,null,null,null,null,null,7.6,10,"EXTREMO","● Debida diligencia Intensificada.\n● Consulta AMLRISK y CENTINELA.\n● Proceso de actualizacion mínimo 1 vez al año",null,4,"ZONA NORTE - CARTAGENA - NO VIGENTES"]
[5,5,2025,null,null,null,null,null,null,null,null,null,null,null,null,null,7,"ZONA NOROCCIDENTAL  - MONTERIA - NO VIGENTES"]
[6,6,2026,null,null,null,null,null,null,null,null,"RANGO","NIVEL",null,null,null,9,"TEUSAQUILLO"]
[7,7,2027,null,null,null,null,null,null,null,null,0,"BAJO",null,null,null,10,"ZONA ORIENTAL - CUCUTA - NO VIGENTES"]
[8,8,2028,null,null,null,null,null,null,null,null,0.1,"BAJO",null,null,null,11,"ANTIGUO COUNTRY"]
[9,9,2029,null,null,null,null,null,null,null,null,0.2,"BAJO",null,null,null,12,"CIUDAD UNIVERSITARIA"]
[10,10,2030,null,null,null,null,null,null,null,null,0.3,"BAJO",null,null,null,13,"DEL SUR"]
[11,11,2031,null,null,null,null,null,null,null,null,0.4,"BAJO",null,null,null,14,"EL DORADO"]
[12,12,2032,null,null,null,null,null,null,null,null,0.5,"BAJO",null,null,null,15,"KENNEDY"]
[13,null,2033,null,null,null,null,null,null,null,null,0.6,"BAJO",null,null,null,16,"BOGOTA - WEB 961"]
[14,null,2034,null,null,null,null,null,null,null,null,0.7,"BAJO",null,null,null,17,"MARLY"]
[15,null,2035,null,null,null,null,null,null,null,null,0.8,"BAJO",null,null,null,18,"MUZÚ"]
[16,null,2036,null,null,null,null,null,null,null,null,0.9,"BAJO",null,null,null,19,"BARRIO RICAURTE"]
[17,null,2037,null,null,null,null,null,null,null,null,1,"BAJO",null,null,null,21,"BOGOTA - WEB 961"]
[18,null,2038,null,null,null,null,null,null,null,null,1.1000000000000001,"BAJO",null,null,null,22,"USAQUÉN"]
[19,null,2039,null,null,null,null,null,null,null,null,1.2,"BAJO",null,null,null,23,"VILLAPINZÓN"]
[20,null,2040,null,null,null,null,null,null,null,null,1.3,"BAJO",null,null,null,24,"BOGOTA - WEB 961"]
[21,null,2041,null,null,null,null,null,null,null,null,1.4,"BAJO",null,null,null,25,"FERIA EXPOSICIÓN"]
[22,null,2042,null,null,null,null,null,null,null,null,1.5,"BAJO",null,null,null,26,"LOS MINISTERIOS"]
[23,null,2043,null,null,null,null,null,null,null,null,1.6,"BAJO",null,null,null,29,"LA CASTELLANA"]
[24,null,2044,null,null,null,null,null,null,null,null,1.7,"BAJO",null,null,null,30,"CANTÓN NORTE"]
[25,null,2045,null,null,null,null,null,null,null,null,1.8,"BAJO",null,null,null,31,"BOGOTA - WEB 961"]
[26,null,2046,null,null,null,null,null,null,null,null,1.9,"BAJO",null,null,null,32,"CENTRO ADMINISTRATIVO DISTRITAL"]
[27,null,2047,null,null,null,null,null,null,null,null,2,"BAJO",null,null,null,33,"SIBATÉ"]
[28,null,2048,null,null,null,null,null,null,null,null,2.1,"BAJO",null,null,null,34,"BARRIO CLARET"]
[29,null,2049,null,null,null,null,null,null,null,null,2.2000000000000002,"BAJO",null,null,null,35,"VEINTE DE JULIO"]
{"$rows_left_out":391}